{"text_format":"1","workbook":"xlsx","n_sheets":5,"sheets":["Вариант ","Старт","Вариант 1","Структура","Навесные"],"not_rendered":{"charts":0,"images":19,"macros":1,"external_links":0,"defined_names":28,"comments":0,"pivot_tables":0},"unopened":[],"bounds":{"document_bytes":16777216,"sheet_cells":100000,"rows_first":2000,"rows_last":500,"rows_between":2000,"halvings":0,"cell_chars":16384,"cell_head_chars":4096},"cells_cut":0,"cells_raw":0,"read":"whole","date_system":"1900"}

{"sheet":"Вариант ","index":0,"n_rows":73,"n_cols":10,"rows_kept":73,"cut":false,"hidden":true,"merged":[[6,0,6,5],[3,1,3,3],[2,1,2,3],[1,1,1,3]]}
[]
["Система обозначения:","Параметры обязательные для ввода, используются непосредственно для выбора оборудования и расчёта его стоимости"]
[null,"Параметры не влияющие непосредственно на выбор оборудования, но необходимые при окончательном согласовании технических характеристик"]
[null,"Итоговые результаты выбора оборудования и расчёта его стоимости с учётом указанных характеристик котлов, котельной и дополнительного оборудования"]
[]
[]
[{"$f":"B69&IF(B70<>\"\",\" (ИНН: \"&B70&\")\",\"\")&\" \"&MID(CELL(\"filename\",A1),FIND(\"]\",CELL(\"filename\",A1))+1,65535)","v":" Вариант "}]
[]
["Подбор котловой автоматики"]
["Марка котла:"]
["Марка горелки:"]
["Колич. котлов:",null,null,{"$f":"IF(B12=\"Нет\",0,B12)","v":0}]
["Тип котла:"]
["Тип горелки:",null,null,{"$f":"IF(B14<>\"\",IF(B14=\"Без встроенного менеджера горения\",1,2),НД)","v":{"$error":"#NAME?"}}]
["Насосы на котле:",null,"Насосы осуществляющие циркуляцию теплоносителя через отдельный котел"]
["Количество исполнит. механизмов:",null,"Количество исполнительных механизмов, управляемых котловым блоком автоматики",{"$f":"IF(B16=\"До 16\",20,IF(B16=\"До 9\",10,0))","v":0},null,null,null,{"$f":"IF(OR(D16:D19),100,0)","v":0}]
["Количество дискретных датчиков:",null,"Количество дискретных датчиков, контролируемых котловым блоком автоматики",{"$f":"IF(B17=\"До 16\",20,IF(B17=\"До 9\",10,0))","v":0}]
["Количество токовых аналоговых датчиков:",null,"Количество токовых датчиков (4-20мА), контролируемых котловым блоком автоматики",{"$f":"IF(B18=\"До 6\",20,IF(B18=\"До 4\",10,0))","v":0}]
["Количество датчиков температуры:",null,"Количество аналоговых датчиков температуры, контролируемых котловым блоком автоматики",{"$f":"IF(B19=\"До 6\",20,IF(B19=\"До 4\",10,0))","v":0},{"$f":"IF(AND(B12<>\"\",B12<>\"Нет\"),IF(B13=\"Паровой\",D14+20,D14+MAX(D16:D19)),НД)","v":{"$error":"#NAME?"}}]
[{"$f":"IFERROR(\"Навесные\",\"\")","v":"Навесные"},{"$f":"IFERROR(INDEX(Структура!2:2,,MATCH(E19,Структура!3:3,0)),\"\")","v":""},null,"Кол-во","Производитель","Цена за шт. с НДС","Сумма с НДС"]
["Блоки котловой автоматики:",{"$f":"IF(B20=\"\",\"\",B20&IF(D12>1,\" (\"&D12&\"шт.)\",\"\"))","v":""},{"$f":"IFERROR(INDEX(Структура!4:4,,MATCH(E19,Структура!3:3,0)),\"\")","v":""},{"$f":"IF(AND(B12>0,B12<>\"Нет\"),B12,\"\")","v":""},{"$f":"IF(B21<>\"\",\"АВИС\",\"\")","v":""},{"$f":"IF(H21>0,H21,\"\")","v":""},{"$f":"IF(AND(F21<>\"\",D21<>\"\"),F21*D21,\"\")","v":""},{"$f":"IFERROR(INDEX(Навесные!C:C,MATCH(B20,Навесные!B:B,0)),0)","v":0},{"$f":"IF(B12<>\"Нет\",H21*B12,0)","v":0}]
[]
["Доп. котловое оборудование","Тип элемента","Элемент","Кол-во (на все котлы)","Производитель","Цена за шт. с НДС","Сумма с НДС"]
[{"$f":"IFERROR(INDEX(INDIRECT(\"Структура!\"&LEFT(ADDRESS(ROW(),MATCH($A$20,Структура!$5:$5,0)-1,4))&\":\"&LEFT(ADDRESS(ROW(),MATCH($A$20,Структура!$5:$5,0)-1,4))),MATCH(B24,INDIRECT(\"Структура!\"&LEFT(ADDRESS(ROW(),MATCH($A$20,Структура!$5:$5,0),4))&\":\"&LEFT(ADDRESS(ROW(),MATCH($A$20,Структура!$5:$5,0),4))),0)),\"\")","v":""},null,null,null,{"$f":"IFERROR(IF(C24=\"Нет\",\"\",INDEX(Навесные!D:D,MATCH(C24,Навесные!B:B,0))),\"\")","v":""},{"$f":"IFERROR(IF(C24=\"Нет\",\"\",INDEX(Навесные!C:C,MATCH(C24,Навесные!B:B,0))),\"\")","v":""},{"$f":"IF(AND(D24>0,F24<>\"\"),D24*F24,\"\")","v":""},{"$f":"IFERROR(IF(C24=\"Нет\",0,INDEX(Навесные!C:C,MATCH(C24,Навесные!B:B,0))),0)","v":0},{"$f":"H24*D24","v":0}]
[]
[]
[]
[null,null,null,null,null,"ИТОГО:",{"$f":"IF(SUM(I24:I27)=0,\"\",SUM(I24:I27))","v":""}]
["Подбор общекотельной автоматики"]
["Количество исполнит. механизмов:",null,"Количество исполнительных механизмов, управляемых общекотельным блоком автоматики",{"$f":"IF(B30=\"До 21\",TRUE,FALSE)","v":false},null,null,null,{"$f":"OR(D30:D33)","v":false}]
["Количество дискретных датчиков:",null,"Количество дискретных датчиков, контролируемых общекотельным блоком автоматики",{"$f":"IF(B31=\"До 30\",TRUE,FALSE)","v":false}]
["Количество токовых аналоговых датчиков:",null,"Количество токовых датчиков (4-20мА), контролируемых общекотельным блоком автоматики",{"$f":"IF(B32=\"До 12\",TRUE,FALSE)","v":false}]
["Количество датчиков температуры:",null,"Количество аналоговых датчиков температуры, контролируемых общекотельным блоком автоматики",{"$f":"IF(B33=\"До 12\",TRUE,FALSE)","v":false}]
["Насосное оборудование","Количество","Тип насосов","Мощн., кВт","Индивидуальные УПП для насосов"]
["Насосы контура 1:",null,null,null,null,null,null,{"$f":"IFERROR(IF(AND(D35>0,D35<15),IF(OR(B35=\"\",B35=\"Нет\"),0,B35),0),0)","v":0},{"$f":"IFERROR(IF(AND(B35>=1,B35<=3),IF(D35=15,15,IF(AND(D35>15,D35<=18.5),18.5,IF(AND(D35>18.5,D35<=22),22,IF(AND(D35>22,D35<=30),30,IF(AND(D35>30,D35<=37),37,IF(AND(D35>37,D35<=45),45,IF(AND(D35>45,D35<=55),55,IF(AND(D35>55,D35<=75),75,IF(AND(D35>75,D35<=90),90,IF(AND(D35>90,D35<=115),115,0)))))))))),0),0)","v":0},{"$f":"IFERROR(IF(I35>0,IF(E35=\"Нет\",INDEX(Навесные!C:C,MATCH(\"БК-\"&I35&\"-\"&B35,Навесные!B:B,0)),INDEX(Навесные!C:C,MATCH(\"БК-\"&I35&\"-1\",Навесные!B:B,0))*B35),0),0)","v":0}]
["Насосы контура 2:",null,null,null,null,null,null,0,0,{"$f":"IFERROR(IF(I36>0,IF(E36=\"Нет\",INDEX(Навесные!C:C,MATCH(\"БК-\"&I36&\"-\"&B36,Навесные!B:B,0)),INDEX(Навесные!C:C,MATCH(\"БК-\"&I36&\"-1\",Навесные!B:B,0))*B36),0),0)","v":0}]
["Насосы контура 3:",null,null,null,null,null,null,0,0,{"$f":"IFERROR(IF(I37>0,IF(E37=\"Нет\",INDEX(Навесные!C:C,MATCH(\"БК-\"&I37&\"-\"&B37,Навесные!B:B,0)),INDEX(Навесные!C:C,MATCH(\"БК-\"&I37&\"-1\",Навесные!B:B,0))*B37),0),0)","v":0}]
["Насосы контура 4:",null,null,null,null,null,null,0,0,{"$f":"IFERROR(IF(I38>0,IF(E38=\"Нет\",INDEX(Навесные!C:C,MATCH(\"БК-\"&I38&\"-\"&B38,Навесные!B:B,0)),INDEX(Навесные!C:C,MATCH(\"БК-\"&I38&\"-1\",Навесные!B:B,0))*B38),0),0)","v":0}]
["Насосы контура 5:",null,null,null,null,null,null,0,0,{"$f":"IFERROR(IF(I39>0,IF(E39=\"Нет\",INDEX(Навесные!C:C,MATCH(\"БК-\"&I39&\"-\"&B39,Навесные!B:B,0)),INDEX(Навесные!C:C,MATCH(\"БК-\"&I39&\"-1\",Навесные!B:B,0))*B39),0),0)","v":0}]
["Насосы контура 6:",null,null,null,null,null,null,0,0,{"$f":"IFERROR(IF(I40>0,IF(E40=\"Нет\",INDEX(Навесные!C:C,MATCH(\"БК-\"&I40&\"-\"&B40,Навесные!B:B,0)),INDEX(Навесные!C:C,MATCH(\"БК-\"&I40&\"-1\",Навесные!B:B,0))*B40),0),0)","v":0}]
{"$rows_left_out":34}
{"sheet":"Старт","index":1,"n_rows":29,"n_cols":7,"rows_kept":29,"cut":false,"hidden":false,"merged":[]}
[]
[]
[]
[null,null,null,null,null,null,"Для начала работы с приложением необходимо \"Включить активное содержимое файла\", "]
[null,null,null,null,null,null,"тем самым разрешив работу встроенных макросов и элементов ActiveX."]
[null,null,null,null,null,null,"Жёлтая панель сообщений со значком щита и кнопкой \"Включить содержимое\" или \"Параметры…\"."]
[]
[]
[null,null,null,null,null,null,"Приложение для подбора и расчёта стоимости блоков автоматического управления для котлов и котельных"]
[null,null,null,null,null,null,"и сопутствующего им оборудования."]
[]
[]
[]
[]
[]
[]
[]
[]
[]
[]
[]
[]
[]
[]
[]
[]
[]
["v. 7.10(17.06.26)"]
["Price-list 17.06.26"]

{"sheet":"Вариант 1","index":2,"n_rows":73,"n_cols":10,"rows_kept":73,"cut":false,"hidden":true,"merged":[[1,1,1,3],[2,1,2,3],[3,1,3,3],[6,0,6,5]]}
[]
["Система обозначения:","Параметры обязательные для ввода, используются непосредственно для выбора оборудования и расчёта его стоимости"]
[null,"Параметры не влияющие непосредственно на выбор оборудования, но необходимые при окончательном согласовании технических характеристик"]
[null,"Итоговые результаты выбора оборудования и расчёта его стоимости с учётом указанных характеристик котлов, котельной и дополнительного оборудования"]
[]
[]
[{"$f":"B69&IF(B70<>\"\",\" (ИНН: \"&B70&\")\",\"\")&\" \"&MID(CELL(\"filename\",A1),FIND(\"]\",CELL(\"filename\",A1))+1,65535)","v":" Вариант 1"}]
[]
["Подбор котловой автоматики"]
["Марка котла:"]
["Марка горелки:"]
["Колич. котлов:",null,null,{"$f":"IF(B12=\"Нет\",0,B12)","v":0}]
["Тип котла:"]
["Тип горелки:",null,null,{"$f":"IF(B14<>\"\",IF(B14=\"Без встроенного менеджера горения\",1,2),НД)","v":{"$error":"#NAME?"}}]
["Насосы на котле:",null,"Насосы осуществляющие циркуляцию теплоносителя через отдельный котел"]
["Количество исполнит. механизмов:",null,"Количество исполнительных механизмов, управляемых котловым блоком автоматики",{"$f":"IF(B16=\"До 16\",20,IF(B16=\"До 9\",10,0))","v":0},null,null,null,{"$f":"IF(OR(D16:D19),100,0)","v":0}]
["Количество дискретных датчиков:",null,"Количество дискретных датчиков, контролируемых котловым блоком автоматики",{"$f":"IF(B17=\"До 16\",20,IF(B17=\"До 9\",10,0))","v":0}]
["Количество токовых аналоговых датчиков:",null,"Количество токовых датчиков (4-20мА), контролируемых котловым блоком автоматики",{"$f":"IF(B18=\"До 6\",20,IF(B18=\"До 4\",10,0))","v":0}]
["Количество датчиков температуры:",null,"Количество аналоговых датчиков температуры, контролируемых котловым блоком автоматики",{"$f":"IF(B19=\"До 6\",20,IF(B19=\"До 4\",10,0))","v":0},{"$f":"IF(AND(B12<>\"\",B12<>\"Нет\"),IF(B13=\"Паровой\",D14+20,D14+MAX(D16:D19)),НД)","v":{"$error":"#NAME?"}}]
[{"$f":"IFERROR(\"Навесные\",\"\")","v":"Навесные"},{"$f":"IFERROR(INDEX(Структура!2:2,,MATCH(E19,Структура!3:3,0)),\"\")","v":""},null,"Кол-во","Производитель","Цена за шт. с НДС","Сумма с НДС"]
["Блоки котловой автоматики:",{"$f":"IF(B20=\"\",\"\",B20&IF(D12>1,\" (\"&D12&\"шт.)\",\"\"))","v":""},{"$f":"IFERROR(INDEX(Структура!4:4,,MATCH(E19,Структура!3:3,0)),\"\")","v":""},{"$f":"IF(AND(B12>0,B12<>\"Нет\"),B12,\"\")","v":""},{"$f":"IF(B21<>\"\",\"АВИС\",\"\")","v":""},{"$f":"IF(H21>0,H21,\"\")","v":""},{"$f":"IF(AND(F21<>\"\",D21<>\"\"),F21*D21,\"\")","v":""},{"$f":"IFERROR(INDEX(Навесные!C:C,MATCH(B20,Навесные!B:B,0)),0)","v":0},{"$f":"IF(B12<>\"Нет\",H21*B12,0)","v":0}]
[]
["Доп. котловое оборудование","Тип элемента","Элемент","Кол-во (на все котлы)","Производитель","Цена за шт. с НДС","Сумма с НДС"]
[{"$f":"IFERROR(INDEX(INDIRECT(\"Структура!\"&LEFT(ADDRESS(ROW(),MATCH($A$20,Структура!$5:$5,0)-1,4))&\":\"&LEFT(ADDRESS(ROW(),MATCH($A$20,Структура!$5:$5,0)-1,4))),MATCH(B24,INDIRECT(\"Структура!\"&LEFT(ADDRESS(ROW(),MATCH($A$20,Структура!$5:$5,0),4))&\":\"&LEFT(ADDRESS(ROW(),MATCH($A$20,Структура!$5:$5,0),4))),0)),\"\")","v":""},null,null,null,{"$f":"IFERROR(IF(C24=\"Нет\",\"\",INDEX(Навесные!D:D,MATCH(C24,Навесные!B:B,0))),\"\")","v":""},{"$f":"IFERROR(IF(C24=\"Нет\",\"\",INDEX(Навесные!C:C,MATCH(C24,Навесные!B:B,0))),\"\")","v":""},{"$f":"IF(AND(D24>0,F24<>\"\"),D24*F24,\"\")","v":""},{"$f":"IFERROR(IF(C24=\"Нет\",0,INDEX(Навесные!C:C,MATCH(C24,Навесные!B:B,0))),0)","v":0},{"$f":"H24*D24","v":0}]
[]
[]
[]
[null,null,null,null,null,"ИТОГО:",{"$f":"IF(SUM(I24:I27)=0,\"\",SUM(I24:I27))","v":""}]
["Подбор общекотельной автоматики"]
["Количество исполнит. механизмов:",null,"Количество исполнительных механизмов, управляемых общекотельным блоком автоматики",{"$f":"IF(B30=\"До 21\",TRUE,FALSE)","v":false},null,null,null,{"$f":"OR(D30:D33)","v":false}]
["Количество дискретных датчиков:",null,"Количество дискретных датчиков, контролируемых общекотельным блоком автоматики",{"$f":"IF(B31=\"До 30\",TRUE,FALSE)","v":false}]
["Количество токовых аналоговых датчиков:",null,"Количество токовых датчиков (4-20мА), контролируемых общекотельным блоком автоматики",{"$f":"IF(B32=\"До 12\",TRUE,FALSE)","v":false}]
["Количество датчиков температуры:",null,"Количество аналоговых датчиков температуры, контролируемых общекотельным блоком автоматики",{"$f":"IF(B33=\"До 12\",TRUE,FALSE)","v":false}]
["Насосное оборудование","Количество","Тип насосов","Мощн., кВт","Индивидуальные УПП для насосов"]
["Насосы контура 1:",null,null,null,null,null,null,{"$f":"IFERROR(IF(AND(D35>0,D35<15),IF(OR(B35=\"\",B35=\"Нет\"),0,B35),0),0)","v":0},{"$f":"IFERROR(IF(AND(B35>=1,B35<=3),IF(D35=15,15,IF(AND(D35>15,D35<=18.5),18.5,IF(AND(D35>18.5,D35<=22),22,IF(AND(D35>22,D35<=30),30,IF(AND(D35>30,D35<=37),37,IF(AND(D35>37,D35<=45),45,IF(AND(D35>45,D35<=55),55,IF(AND(D35>55,D35<=75),75,IF(AND(D35>75,D35<=90),90,IF(AND(D35>90,D35<=115),115,0)))))))))),0),0)","v":0},{"$f":"IFERROR(IF(I35>0,IF(E35=\"Нет\",INDEX(Навесные!C:C,MATCH(\"БК-\"&I35&\"-\"&B35,Навесные!B:B,0)),INDEX(Навесные!C:C,MATCH(\"БК-\"&I35&\"-1\",Навесные!B:B,0))*B35),0),0)","v":0}]
["Насосы контура 2:",null,null,null,null,null,null,0,0,{"$f":"IFERROR(IF(I36>0,IF(E36=\"Нет\",INDEX(Навесные!C:C,MATCH(\"БК-\"&I36&\"-\"&B36,Навесные!B:B,0)),INDEX(Навесные!C:C,MATCH(\"БК-\"&I36&\"-1\",Навесные!B:B,0))*B36),0),0)","v":0}]
["Насосы контура 3:",null,null,null,null,null,null,0,0,{"$f":"IFERROR(IF(I37>0,IF(E37=\"Нет\",INDEX(Навесные!C:C,MATCH(\"БК-\"&I37&\"-\"&B37,Навесные!B:B,0)),INDEX(Навесные!C:C,MATCH(\"БК-\"&I37&\"-1\",Навесные!B:B,0))*B37),0),0)","v":0}]
["Насосы контура 4:",null,null,null,null,null,null,0,0,{"$f":"IFERROR(IF(I38>0,IF(E38=\"Нет\",INDEX(Навесные!C:C,MATCH(\"БК-\"&I38&\"-\"&B38,Навесные!B:B,0)),INDEX(Навесные!C:C,MATCH(\"БК-\"&I38&\"-1\",Навесные!B:B,0))*B38),0),0)","v":0}]
["Насосы контура 5:",null,null,null,null,null,null,0,0,{"$f":"IFERROR(IF(I39>0,IF(E39=\"Нет\",INDEX(Навесные!C:C,MATCH(\"БК-\"&I39&\"-\"&B39,Навесные!B:B,0)),INDEX(Навесные!C:C,MATCH(\"БК-\"&I39&\"-1\",Навесные!B:B,0))*B39),0),0)","v":0}]
["Насосы контура 6:",null,null,null,null,null,null,0,0,{"$f":"IFERROR(IF(I40>0,IF(E40=\"Нет\",INDEX(Навесные!C:C,MATCH(\"БК-\"&I40&\"-\"&B40,Навесные!B:B,0)),INDEX(Навесные!C:C,MATCH(\"БК-\"&I40&\"-1\",Навесные!B:B,0))*B40),0),0)","v":0}]
{"$rows_left_out":34}
{"sheet":"Структура","index":3,"n_rows":30,"n_cols":15,"rows_kept":30,"cut":false,"hidden":true,"merged":[]}
[]
[null,null,null,null,"АК-01.ХХ",null,"АК-02.ХХ",null,"АК-11.ХХ",null,"АК-12.ХХ",null,"АК-21.ХХ",null,"АК-22.ХХ"]
[null,null,null,null,1,null,2,null,11,null,12,null,21,null,22]
[null,null,null,null,"Управление работой водогрейного котла с горелкой без встроенного менеджера горения",null,"Управление работой водогрейного котла со встроенным менеджером горения",null,"Управление работой водогрейного котла с горелкой без встроенного менеджера горения",null,"Управление работой водогрейного котла со встроенным менеджером горения",null,"Управление работой водогрейного котла с горелкой без встроенного менеджера горения",null,"Управление работой водогрейного котла со встроенным менеджером горения"]
[null,"Навесные"]
["Датчик_температуры_теплоносителя","Датчик температуры теплоносителя"]
["Датчик_температуры_воздуха","Датчик температуры воздуха"]
["Датчик_циркуляции","Датчик циркуляции"]
["Датчик_давления_теплоносителя","Датчик давления теплоносителя"]
["Датчик_давления_теплоносителя_4_20мА","Датчик давления теплоносителя 4-20мА"]
["Датчик_давления_топлива","Датчик давления топлива"]
["Датчик_давления_топлива_4_20мА","Датчик давления топлива 4-20мА"]
["Датчик_тяги","Датчик тяги"]
["Датчик_тяги_4_20мА","Датчик тяги 4-20мА"]
["Предельный_термостат","Предельный термостат"]
["Контроль_вентилятора","Контроль вентилятора (дымососа)"]
["Датчик_уровня_теплоносителя","Датчик уровня"]
["Датчик_ПДК_газа","Датчик ПДК газа"]
["Датчик_пожара","Датчик пожара"]
["Датчик_вскрытия_помещения","Датчик вскрытия помещения"]
["Контроль_доступа","Контроль доступа"]
["Аварийный_оповещатель","Аварийный оповещатель"]
["Передача_телеметрии","Передача телеметрии"]
["Регулятор_управления_краном_подмешивания","Регулятор управления краном подмешивания"]
["Источник_бесперебойного_питания","Источник бесперебойного питания"]
["Блок_питания_24В","Блок питания 24В"]
["Блок_розжига","Блок розжига",null,null,"Управление работой оборудования котельной.",null,"Управление работой оборудования котельной."]
["Датчик_пламени","Датчик пламени",null,null,"АО_30",null,"АО_20"]
["Клапан_газовый","Клапан газовый"]
["Контактор_в_оболочке_с_тепловым_реле","Контактор в оболочке"]

{"sheet":"Навесные","index":4,"n_rows":213,"n_cols":6,"rows_kept":213,"cut":false,"hidden":true,"merged":[]}
[null,"Навесные элементы","Цена с НДС","Производитель"]
[]
[null,"Датчик давления теплоносителя 4-20мА"]
[null,"Нет"]
[null,"Преобразователь давления ДДМ-03Т-ДИ, (класс 0.5)",4670,"Прома",null,"ЗАК(К)"]
[null,"Манометр с токовым выходом АДМ-100.3 IP20, (класс 2.5(по показ.))",7200,"Агава",null,"ЗАК(К)"]
[null,"Преобразователь давления ПД100-ДИ-311-1,0, (класс 1.0 с керамическим сенсором)",5570,"ОВЕН",null,"ЗАК(К)"]
[null,"Преобразователь давления ПД100-ДИ-111-1,0, (класс 1.0 с мембраной из нерж. стали)",6590,"ОВЕН",null,"ЗАК(К)"]
[]
[null,"Датчик давления топлива 4-20мА"]
[null,"Нет"]
[null,"Преобразователь давления ДДМ-1012-ДИ, (класс 1.0)",15970,"Прома",null,"ЗАК(К)"]
[null,"Преобразователь давления ПД100И-ДИ-811-0,5, (класс 0.5)",12060,"ОВЕН",null,"ЗАК(К)"]
[null,"Преобразователь давления АДН-10.2, (класс 1.5)",14420,"Агава",null,"ЗАК(К)"]
[]
[null,"Датчик тяги 4-20мА"]
[null,"Нет"]
[null,"Преобразователь давления ПД100И-ДИВ-811-1,5, (класс 1.5)",12060,"ОВЕН",null,"ЗАК(К)"]
[null,"Преобразователь давления ДДМ-ДИВ-0,25",13670,"Прома",null,"ЗАК(К)"]
[null,"Преобразователь давления АДР-0,5.2",20860,"Агава",null,"ЗАК(К)"]
[]
[null,"Датчик давления теплоносителя"]
[null,"Нет"]
[null,"Манометр показывающий МП3-Уф исп ЭКО кт.1,5 d.100 IP40 M20*1,5 РШ (класс 1.5, 100мм)",840,"Физтех",null,"ЗАК(К)"]
[null,"Манометр показывающий ТМ-510Р.М20х1,5. 1,5 (класс 1.5, 100мм)",1260,"РОСМА",null,"ЗАК(К)"]
[null,"ЭКМ ДМ2010ф испV кт.1,5 d.100 IP40 М20*1,5 РШ, (класс 1.5, исп.V, магн.конт.), 2 порога",3740,"Физтех",null,"ЗАК(К)"]
[null,"ЭКМ ТМ−510Р.05 М20х1,5.1,5, (класс 1.5, исп.V, магн.конт.), 2 порога",3270,"РОСМА",null,"ЗАК(К)"]
[null,"Реле давления РД-016-ДИ 220В, (класс 1.5), 2 порога",3430,"Прома",null,"ЗАК(К)"]
[]
[null,"Датчик давления топлива"]
[null,"Нет"]
[null,"Напорометр показывающий КМ-11Р М12х1,5. 2,5 (класс 2.5, 63мм)",2514,"РОСМА",null,"ЗАК(К)"]
[null,"Напоромер показывающий НМПф кт.2,5 d.63 IP40 М12*1,5 РШ (класс 2.5, 63мм)",2910,"Физтех",null,"ЗАК(К)"]
[null,"Реле давления ДРД-Н А (1 порог)",8460,"Термобрест",null,"ЗАК(К)"]
[null,"Реле давления РД-016-ДИ 220В, (класс 1.5, 2 порога)",6150,"Прома",null,"ЗАК(К)"]
[]
[null,"Датчик тяги"]
[null,"Нет"]
[null,"Тягонапорометр показывающий КМВ-22Р М20х1,5. 1,5 (класс 1.5, 100мм)",5370,"РОСМА",null,"ЗАК(К)"]
[null,"Реле давления РД-016-0,25ДИВ 220В, (класс 1.5, ±0,25 кПа)",9160,"Прома",null,"ЗАК(К)"]
{"$rows_left_out":173}